BDBM50137491 1-(4-Methyl-cyclohexyl)-2-pyridin-2-yl-1H-benzoimidazole-5-carboxylic acid::CHEMBL177835
SMILES CC1CCC(CC1)n1c(nc2cc(ccc12)C(O)=O)-c1ccccn1
InChI Key InChIKey=XRCPJMYYGNSJAJ-UHFFFAOYSA-N
Data  1 IC50
  Tab Delimited (TSV)   2D SDfile   Computed 3D by Vconf -m prep SDfile
Find this compound or compounds like it in BindingDB:
Activity Spreadsheet -- Enzyme Inhibition Constant Data from BindingDB
Found 1 hit for monomerid = 50137491
TargetRNA-directed RNA polymerase(Hepatitis C virus)
Boehringer Ingelheim (Canada)
Curated by ChEMBL
LigandPNGBDBM50137491(1-(4-Methyl-cyclohexyl)-2-pyridin-2-yl-1H-benzoimi...)
Affinity DataIC50:  5.00E+4nM. Assay description: Inhibitory activity against NS5B polymerase of hepatitis C virus
In DepthDetails ArticlePubMed