BDBM50137495 1-Cyclohexyl-2-(6-methyl-pyridin-2-yl)-1H-benzoimidazole-5-carboxylic acid::CHEMBL367758
SMILES Cc1cccc(n1)-c1nc2cc(ccc2n1C1CCCCC1)C(O)=O
InChI Key InChIKey=RJDGXOOOFPOIAC-UHFFFAOYSA-N
Data  1 IC50
  Tab Delimited (TSV)   2D SDfile   Computed 3D by Vconf -m prep SDfile
Find this compound or compounds like it in BindingDB:
Activity Spreadsheet -- Enzyme Inhibition Constant Data from BindingDB
Found 1 hit for monomerid = 50137495
TargetRNA-directed RNA polymerase(Hepatitis C virus)
Boehringer Ingelheim (Canada)
Curated by ChEMBL
LigandPNGBDBM50137495(1-Cyclohexyl-2-(6-methyl-pyridin-2-yl)-1H-benzoimi...)
Affinity DataIC50: >3.00E+4nM. Assay description: Inhibitory activity against NS5B polymerase of hepatitis C virus
In DepthDetails ArticlePubMed