BDBM50137521 CHEMBL3752621
SMILES O=C(Nc1ccccc1)Nc1nc(NCc2ccccc2)nc2nc(nn12)-c1ccco1
InChI Key InChIKey=BKGGNZPNCWNCBQ-UHFFFAOYSA-N
Data  3 KI  1 IC50
  Tab Delimited (TSV)   2D SDfile   Computed 3D by Vconf -m prep SDfile
Find this compound or compounds like it in BindingDB:
Activity Spreadsheet -- Enzyme Inhibition Constant Data from BindingDB
Found 4 hits for monomerid = 50137521
TargetAdenosine receptor A2a(Homo sapiens (Human))
Universit£
Curated by ChEMBL
LigandPNGBDBM50137521(CHEMBL3752621)
Affinity DataKi:  1.40nM. Assay description: Displacement of [3H]NECA from human A2A adenosine receptor expressed in CHO cell membranes
In DepthDetails ArticlePubMed
TargetAdenosine receptor A3(Homo sapiens (Human))
Universit£
Curated by ChEMBL
LigandPNGBDBM50137521(CHEMBL3752621)
Affinity DataKi:  30nM. Assay description: Displacement of [3H]HEMADO from human A3 adenosine receptor expressed in CHO cell membranes
In DepthDetails ArticlePubMed
TargetAdenosine receptor A1(Homo sapiens (Human))
Universit£
Curated by ChEMBL
LigandPNGBDBM50137521(CHEMBL3752621)
Affinity DataKi:  311nM. Assay description: Displacement of [3H]CCPA from human A1 adenosine receptor expressed in CHO cell membranes
In DepthDetails ArticlePubMed
TargetAdenosine receptor A2b(Homo sapiens (Human))
Universit£
Curated by ChEMBL
LigandPNGBDBM50137521(CHEMBL3752621)
Affinity DataIC50:  4.36E+3nM. Assay description: Antagonist activity at human A2B adenosine receptor expressed in CHO cell membranes assessed as inhibition of NECA stimulated adenylyl cyclase activi...
In DepthDetails ArticlePubMed