BDBM50138284 CHEMBL3754005
SMILES COc1cccc2cc(CN(CCCCCCCNc3c4CCCCCc4nc4ccccc34)Cc3cc4cccc(OC)c4o3)oc12
InChI Key InChIKey=WAYXSSGTGMIORU-UHFFFAOYSA-N
Data  2 IC50
  Tab Delimited (TSV)   2D SDfile   Computed 3D by Vconf -m prep SDfile
Find this compound or compounds like it in BindingDB:
Activity Spreadsheet -- Enzyme Inhibition Constant Data from BindingDB
Found 2 hits for monomerid = 50138284
TargetCholinesterase(Homo sapiens (Human))
China Pharmaceutical University
Curated by ChEMBL
LigandPNGBDBM50138284(CHEMBL3754005)
Affinity DataIC50:  4.90nM. Assay description: Inhibition of human serum BChE using butyrylthiocholine iodide as substrate preincubated for 20 mins followed by substrate addition by Ellman's metho...
In DepthDetails ArticlePubMed
TargetAcetylcholinesterase(Homo sapiens (Human))
China Pharmaceutical University
Curated by ChEMBL
LigandPNGBDBM50138284(CHEMBL3754005)
Affinity DataIC50:  199nM. Assay description: Inhibition of recombinant human AChE using acetylthiocholine iodide as substrate preincubated for 20 mins followed by substrate addition by Ellman's ...
In DepthDetails ArticlePubMed