BDBM50138288 4-((S)-3-(4-Chloro-benzyl)-4-{4-[2-(2-cyclopropyl-1-methanesulfonyl-ethyl)-phenyl]-piperazin-1-yl}-4-oxo-butyryl)-piperazine-1-carboxylic acid ethyl ester::CHEMBL332443
SMILES CCOC(=O)N1CCN(CC1)C(=O)C[C@H](Cc1ccc(Cl)cc1)C(=O)N1CCN(CC1)c1ccccc1N(CC1CC1)S(C)(=O)=O
InChI Key InChIKey=JERVARGQNLUPFY-MHZLTWQESA-N
Data  3 IC50  1 EC50
  Tab Delimited (TSV)   2D SDfile   Computed 3D by Vconf -m prep SDfile
Find this compound or compounds like it in BindingDB:
Activity Spreadsheet -- Enzyme Inhibition Constant Data from BindingDB
Found 4 hits for monomerid = 50138288
TargetMelanocortin receptor 3(Homo sapiens (Human))
Amgen
Curated by ChEMBL
LigandPNGBDBM50138288(4-((S)-3-(4-Chloro-benzyl)-4-{4-[2-(2-cyclopropyl-...)
Affinity DataIC50: >1.00E+4nM. Assay description: Inhibitory activity against human melanocortin 3 receptor
In DepthDetails ArticlePubMed
TargetMelanocortin receptor 4(Homo sapiens (Human))
Amgen
Curated by ChEMBL
LigandPNGBDBM50138288(4-((S)-3-(4-Chloro-benzyl)-4-{4-[2-(2-cyclopropyl-...)
Affinity DataEC50: >1.00E+4nM. Assay description: Inhibitory activity against [125I]-NDP-alpha-MSH binding to the human melanocortin 4 receptor
In DepthDetails ArticlePubMed
TargetMelanocortin receptor 4(Homo sapiens (Human))
Amgen
Curated by ChEMBL
LigandPNGBDBM50138288(4-((S)-3-(4-Chloro-benzyl)-4-{4-[2-(2-cyclopropyl-...)
Affinity DataIC50:  1.40nM. Assay description: Inhibitory activity against [125I]-NDP-alpha-MSH binding to the human melanocortin 4 receptor
In DepthDetails ArticlePubMed
TargetMelanocyte-stimulating hormone receptor(Mus musculus)
Amgen
Curated by ChEMBL
LigandPNGBDBM50138288(4-((S)-3-(4-Chloro-benzyl)-4-{4-[2-(2-cyclopropyl-...)
Affinity DataIC50: >1.00E+4nM. Assay description: Inhibitory activity against mouse melanocortin 1 receptor
In DepthDetails ArticlePubMed