BDBM50138293 (S)-2-(4-Chloro-benzyl)-1-{4-[2-(2-cyclopropyl-1-methanesulfonyl-ethyl)-phenyl]-piperazin-1-yl}-4-[4-(3,3-dimethyl-butyryl)-piperazin-1-yl]-butane-1,4-dione::CHEMBL337940
SMILES CC(C)(C)CC(=O)N1CCN(CC1)C(=O)C[C@H](Cc1ccc(Cl)cc1)C(=O)N1CCN(CC1)c1ccccc1N(CC1CC1)S(C)(=O)=O
InChI Key InChIKey=OSIKZXMAWQMSAN-LJAQVGFWSA-N
Data  3 IC50  1 EC50
  Tab Delimited (TSV)   2D SDfile   Computed 3D by Vconf -m prep SDfile
Find this compound or compounds like it in BindingDB:
Activity Spreadsheet -- Enzyme Inhibition Constant Data from BindingDB
Found 4 hits for monomerid = 50138293
TargetMelanocortin receptor 3(Homo sapiens (Human))
Amgen
Curated by ChEMBL
LigandPNGBDBM50138293((S)-2-(4-Chloro-benzyl)-1-{4-[2-(2-cyclopropyl-1-m...)
Affinity DataIC50: >1.00E+4nM. Assay description: Inhibitory activity against human melanocortin 3 receptor
In DepthDetails ArticlePubMed
TargetMelanocortin receptor 4(Homo sapiens (Human))
Amgen
Curated by ChEMBL
LigandPNGBDBM50138293((S)-2-(4-Chloro-benzyl)-1-{4-[2-(2-cyclopropyl-1-m...)
Affinity DataIC50: <0.100nM. Assay description: Intracellular level of cAMP in cells expressing the melanocortin 4 receptor
In DepthDetails ArticlePubMed
TargetMelanocortin receptor 4(Homo sapiens (Human))
Amgen
Curated by ChEMBL
LigandPNGBDBM50138293((S)-2-(4-Chloro-benzyl)-1-{4-[2-(2-cyclopropyl-1-m...)
Affinity DataEC50:  74nM. Assay description: Intracellular level of cAMP in cells expressing the melanocortin 4 receptor
In DepthDetails ArticlePubMed
TargetMelanocyte-stimulating hormone receptor(Mus musculus)
Amgen
Curated by ChEMBL
LigandPNGBDBM50138293((S)-2-(4-Chloro-benzyl)-1-{4-[2-(2-cyclopropyl-1-m...)
Affinity DataIC50: >1.80E+3nM. Assay description: Inhibitory activity against mouse melanocortin 1 receptor
In DepthDetails ArticlePubMed