BDBM50138295 (S)-2-(4-Chloro-benzyl)-1-{4-[2-(2-cyclopropyl-1-methanesulfonyl-ethyl)-phenyl]-piperazin-1-yl}-4-piperazin-1-yl-butane-1,4-dione::CHEMBL338747
SMILES CS(=O)(=O)N(CC1CC1)c1ccccc1N1CCN(CC1)C(=O)[C@H](CC(=O)N1CCNCC1)Cc1ccc(Cl)cc1
InChI Key InChIKey=XECNSIFQPWQYCT-VWLOTQADSA-N
Data  3 IC50  1 EC50
  Tab Delimited (TSV)   2D SDfile   Computed 3D by Vconf -m prep SDfile
Find this compound or compounds like it in BindingDB:
Activity Spreadsheet -- Enzyme Inhibition Constant Data from BindingDB
Found 4 hits for monomerid = 50138295
TargetMelanocyte-stimulating hormone receptor(Mus musculus)
Amgen
Curated by ChEMBL
LigandPNGBDBM50138295((S)-2-(4-Chloro-benzyl)-1-{4-[2-(2-cyclopropyl-1-m...)
Affinity DataIC50: >8.00E+3nM. Assay description: Inhibitory activity against mouse melanocortin 1 receptor
In DepthDetails ArticlePubMed
TargetMelanocortin receptor 4(Homo sapiens (Human))
Amgen
Curated by ChEMBL
LigandPNGBDBM50138295((S)-2-(4-Chloro-benzyl)-1-{4-[2-(2-cyclopropyl-1-m...)
Affinity DataEC50:  2.00E+3nM. Assay description: Intracellular level of cAMP in cells expressing the melanocortin 4 receptor
In DepthDetails ArticlePubMed
TargetMelanocortin receptor 4(Homo sapiens (Human))
Amgen
Curated by ChEMBL
LigandPNGBDBM50138295((S)-2-(4-Chloro-benzyl)-1-{4-[2-(2-cyclopropyl-1-m...)
Affinity DataIC50:  220nM. Assay description: Inhibitory activity against [125I]-NDP-alpha-MSH binding to the human melanocortin 4 receptor
In DepthDetails ArticlePubMed
TargetMelanocortin receptor 3(Homo sapiens (Human))
Amgen
Curated by ChEMBL
LigandPNGBDBM50138295((S)-2-(4-Chloro-benzyl)-1-{4-[2-(2-cyclopropyl-1-m...)
Affinity DataIC50: >8.00E+3nM. Assay description: Inhibitory activity against human melanocortin 3 receptor
In DepthDetails ArticlePubMed