BDBM50138635 CHEMBL3754475
SMILES O=C(Cc1ccccc1)Nc1nc(nc2cn(nc12)-c1ccccc1)-c1cccs1
InChI Key InChIKey=PMZQWTKPBDGCHO-UHFFFAOYSA-N
Data  1 KI  1 IC50
  Tab Delimited (TSV)   2D SDfile   Computed 3D by Vconf -m prep SDfile
Find this compound or compounds like it in BindingDB:
Activity Spreadsheet -- Enzyme Inhibition Constant Data from BindingDB
Found 2 hits for monomerid = 50138635
TargetAdenosine receptor A3(Homo sapiens (Human))
Universit£
Curated by ChEMBL
LigandPNGBDBM50138635(CHEMBL3754475)
Affinity DataKi:  3.5nM. Assay description: Displacement of [125I]AB-MECA at human A3A receptor expressed in CHO cell membrane after 60 mins by scintillation counting method
In DepthDetails ArticlePubMed
TargetAdenosine receptor A3(Homo sapiens (Human))
Universit£
Curated by ChEMBL
LigandPNGBDBM50138635(CHEMBL3754475)
Affinity DataIC50:  8.5nM. Assay description: Antagonist activity at human A3 receptor expressed in CHO cells assessed as inhibition of Cl-IB-MECA-induced cAMP production by scintillation countin...
In DepthDetails ArticlePubMed