BDBM50138846 3-[(S)-3-(1-Isopropyl-2-methyl-propoxycarbonylamino)-2-oxo-heptanoylamino]-1H-pyrazole-4-carboxylic acid ethyl ester::CHEMBL155941
SMILES CCCC[C@H](NC(=O)OC(C(C)C)C(C)C)C(=O)C(=O)Nc1[nH]ncc1C(=O)OCC
InChI Key InChIKey=WJDGWVSEUIRGAL-HNNXBMFYSA-N
Data  1 IC50
  Tab Delimited (TSV)   2D SDfile   Computed 3D by Vconf -m prep SDfile
Find this compound or compounds like it in BindingDB:
Activity Spreadsheet -- Enzyme Inhibition Constant Data from BindingDB
Found 1 hit for monomerid = 50138846
TargetCathepsin K(Homo sapiens (Human))
Glaxosmithkline
Curated by ChEMBL
LigandPNGBDBM50138846(3-[(S)-3-(1-Isopropyl-2-methyl-propoxycarbonylamin...)
Affinity DataIC50:  1.70nM. Assay description: Concentration required to inhibit 50% of cysteine protease cathepsin K of human
In DepthDetails ArticlePubMed