BDBM50139082 (S)-3-{4-[(2,6-Dichloro-pyridine-4-carbonyl)-amino]-phenyl}-2-{[2-(2-trifluoromethyl-benzenesulfonyl)-2-aza-bicyclo[2.2.2]octane-3-carbonyl]-amino}-propionic acid::CHEMBL435846
SMILES OC(=O)[C@H](Cc1ccc(NC(=O)c2cc(Cl)nc(Cl)c2)cc1)NC(=O)C1C2CCC(CC2)N1S(=O)(=O)c1ccccc1C(F)(F)F
InChI Key InChIKey=JVKCFBRVLIFZAS-KLKPZBFZSA-N
Data  1 IC50
  Tab Delimited (TSV)   2D SDfile   Computed 3D by Vconf -m prep SDfile
Find this compound or compounds like it in BindingDB:
Activity Spreadsheet -- Enzyme Inhibition Constant Data from BindingDB
Found 1 hit for monomerid = 50139082
TargetIntegrin alpha-4/beta-1(Homo sapiens (Human))
Johnson & Johnson Pharmaceutical Research & Development
Curated by ChEMBL
LigandPNGBDBM50139082((S)-3-{4-[(2,6-Dichloro-pyridine-4-carbonyl)-amino...)
Affinity DataIC50:  18nM. Assay description: In vitro inhibition of binding of integrin alpha4-beta1 to immobilized VCAM-1 expressed on endothelial cell surface.
In DepthDetails ArticlePubMed