BDBM50139083 (S)-3-[4-(2,6-Dichloro-benzoylamino)-phenyl]-2-{[2-(toluene-4-sulfonyl)-2-aza-bicyclo[2.2.2]octane-3-carbonyl]-amino}-propionic acid::CHEMBL345656
SMILES Cc1ccc(cc1)S(=O)(=O)N1C2CCC(CC2)C1C(=O)N[C@@H](Cc1ccc(NC(=O)c2c(Cl)cccc2Cl)cc1)C(O)=O
InChI Key InChIKey=NAJHRSPELCBBQS-VNTITPCMSA-N
Data  1 IC50
  Tab Delimited (TSV)   2D SDfile   Computed 3D by Vconf -m prep SDfile
Find this compound or compounds like it in BindingDB:
Activity Spreadsheet -- Enzyme Inhibition Constant Data from BindingDB
Found 1 hit for monomerid = 50139083
TargetIntegrin alpha-4/beta-1(Homo sapiens (Human))
Johnson & Johnson Pharmaceutical Research & Development
Curated by ChEMBL
LigandPNGBDBM50139083((S)-3-[4-(2,6-Dichloro-benzoylamino)-phenyl]-2-{[2...)
Affinity DataIC50:  45nM. Assay description: In vitro inhibition of binding of integrin alpha4-beta1 to immobilized VCAM-1 expressed on endothelial cell surface.
In DepthDetails ArticlePubMed