BDBM501393 US11026936, Compound A24
SMILES C[C@H]1CN(CC[C@H]1C1(CC1)c1nnc(o1)-c1ccc(C)cc1)C(=O)[C@@](C)(O)C(F)(F)F
InChI Key InChIKey=MVNZMVRBBSOGOS-YYFZDKIDSA-N
Data  1 IC50
  Tab Delimited (TSV)   2D SDfile   Computed 3D by Vconf -m prep SDfile
Find this compound or compounds like it in BindingDB:
Activity Spreadsheet -- Enzyme Inhibition Constant Data from BindingDB
Found 1 hit for monomerid = 501393
LigandPNGBDBM501393(US11026936, Compound A24)
Affinity DataIC50:  7.30E+3nM. Assay description: The PDC inactivation assay is performed in Greiner 384-well microtiter plates and is used for high throughput screen. 4 μl of PDHK2 (human, rec,...
Ligand InfoPC cidPC sid
In DepthDetails US Patent