BDBM50139480 (S)-tert-butyl 1,2-dioxo-1-(thiophen-2-ylmethylamino)heptan-3-ylcarbamate::CHEMBL439649::[(S)-1-(Thiophen-2-ylmethyl)-aminooxalyl]-pentyl)-carbamic acid tert-butyl ester
SMILES CCCC[C@H](NC(=O)OC(C)(C)C)C(=O)C(=O)NCc1cccs1
InChI Key InChIKey=OVNAALASBQXMOG-ZDUSSCGKSA-N
Data  2 IC50
  Tab Delimited (TSV)   2D SDfile   Computed 3D by Vconf -m prep SDfile
Find this compound or compounds like it in BindingDB:
Activity Spreadsheet -- Enzyme Inhibition Constant Data from BindingDB
Found 2 hits for monomerid = 50139480
TargetCathepsin K(Homo sapiens (Human))
Chinese Academy Of Sciences
Curated by ChEMBL
LigandPNGBDBM50139480((S)-tert-butyl 1,2-dioxo-1-(thiophen-2-ylmethylami...)
Affinity DataIC50:  3.39E+3nM. Assay description: Inhibition of human cathepsin K
In DepthDetails ArticlePubMed
TargetCathepsin K(Homo sapiens (Human))
Chinese Academy Of Sciences
Curated by ChEMBL
LigandPNGBDBM50139480((S)-tert-butyl 1,2-dioxo-1-(thiophen-2-ylmethylami...)
Affinity DataIC50:  3.40E+3nM. Assay description: Inhibitory activity against human cathepsin K
In DepthDetails ArticlePubMed