BDBM50139778 CHEMBL3764613
SMILES Nc1nc(C(=O)NCc2ccccc2)c2cccc(F)c2n1
InChI Key InChIKey=FDHGUGPDCVKNFJ-UHFFFAOYSA-N
Data  2 KI
  Tab Delimited (TSV)   2D SDfile   Computed 3D by Vconf -m prep SDfile
Find this compound or compounds like it in BindingDB:
Activity Spreadsheet -- Enzyme Inhibition Constant Data from BindingDB
Found 2 hits for monomerid = 50139778
TargetAdenosine receptor A2a(Homo sapiens (Human))
Merck Research Laboratories
Curated by ChEMBL
LigandPNGBDBM50139778(CHEMBL3764613)
Affinity DataKi:  5.40nM. Assay description: Displacement of [3H]SCH-58261 from human adenosine A2A receptor expressed in HEK cell membranes after 60 mins by microplate scintillation counting an...
In DepthDetails ArticlePubMed
TargetAdenosine receptor A1(Homo sapiens (Human))
Merck Research Laboratories
Curated by ChEMBL
LigandPNGBDBM50139778(CHEMBL3764613)
Affinity DataKi:  83nM. Assay description: Displacement of [3H]DPCPX from human adenosine A1 receptor expressed in CHO cell membranes after 60 mins by microplate scintillation counting analysi...
In DepthDetails ArticlePubMed