BDBM50140136 CHEMBL3576945
SMILES N[C@@H](COC(=O)c1ccc(cc1)-c1ccccc1)C(O)=O
InChI Key InChIKey=JMEQFOWNXZGEET-AWEZNQCLSA-N
Data  1 IC50
  Tab Delimited (TSV)   2D SDfile   Computed 3D by Vconf -m prep SDfile
Find this compound or compounds like it in BindingDB:
Activity Spreadsheet -- Enzyme Inhibition Constant Data from BindingDB
Found 1 hit for monomerid = 50140136
TargetNeutral amino acid transporter B(0)(Homo sapiens (Human))
Vanderbilt University Medical Center
Curated by ChEMBL
LigandPNGBDBM50140136(CHEMBL3576945)
Affinity DataIC50:  3.00E+4nM. Assay description: Inhibition of ASCT2 (unknown origin)-mediated glutamine transport
In DepthDetails ArticlePubMed