BDBM50140415 2-(6-Chloro-naphthalen-2-yl)-5-trifluoromethyl-2H-pyrazole-3-carboxylic acid [2-fluoro-4-(1-methyl-4,5-dihydro-1H-imidazol-2-yl)-phenyl]-amide::CHEMBL281838
SMILES CN1CCN=C1c1ccc(NC(=O)c2cc(nn2-c2ccc3cc(Cl)ccc3c2)C(F)(F)F)c(F)c1
InChI Key InChIKey=IRMIUWHWCBCSNB-UHFFFAOYSA-N
Data  1 KI  1 IC50
  Tab Delimited (TSV)   2D SDfile   Computed 3D by Vconf -m prep SDfile
Find this compound or compounds like it in BindingDB:
Activity Spreadsheet -- Enzyme Inhibition Constant Data from BindingDB
Found 2 hits for monomerid = 50140415
TargetCoagulation factor X(Homo sapiens (Human))
Millennium Pharmaceuticals
Curated by ChEMBL
LigandPNGBDBM50140415(2-(6-Chloro-naphthalen-2-yl)-5-trifluoromethyl-2H-...)
Affinity DataKi:  1.20nM. Assay description: In vitro inhibitory activity against human coagulation factor X
In DepthDetails ArticlePubMed
TargetCoagulation factor X(Homo sapiens (Human))
Millennium Pharmaceuticals
Curated by ChEMBL
LigandPNGBDBM50140415(2-(6-Chloro-naphthalen-2-yl)-5-trifluoromethyl-2H-...)
Affinity DataIC50:  2nM. Assay description: In vitro inhibitory activity against human coagulation factor X
In DepthDetails ArticlePubMed