BDBM50140678 CHEMBL3752769
SMILES OC(=O)CCNc1nc(cc(n1)-n1cccn1)N1CCc2ccccc2C1
InChI Key InChIKey=IEBVIQNPXBCZAK-UHFFFAOYSA-N
Data  1 IC50
  Tab Delimited (TSV)   2D SDfile   Computed 3D by Vconf -m prep SDfile
Find this compound or compounds like it in BindingDB:
Activity Spreadsheet -- Enzyme Inhibition Constant Data from BindingDB
Found 1 hit for monomerid = 50140678
TargetLysine-specific demethylase 6B(Homo sapiens (Human))
Chinese Academy Of Sciences
Curated by ChEMBL
LigandPNGBDBM50140678(CHEMBL3752769)
Affinity DataIC50:  490nM. Assay description: Inhibition of JMJD3 (unknown origin) using biotinylated H3K27me3 peptide as substrate after 1 hr by AlphaLISA assay
In DepthDetails ArticlePubMed