BDBM501409 US11026937, Compound I-4
SMILES CN(C)CCOc1ccc(\C=C\C(=O)c2c(-c3ccccc3)c3cc(F)ccc3[nH]c2=O)cn1
InChI Key InChIKey=XMXQBEIZVKEUFL-XYOKQWHBSA-N
Data  1 IC50
  Tab Delimited (TSV)   2D SDfile   Computed 3D by Vconf -m prep SDfile
Find this compound or compounds like it in BindingDB:
Activity Spreadsheet -- Enzyme Inhibition Constant Data from BindingDB
Found 1 hit for monomerid = 501409
TargetProtein-arginine deiminase type-4(Homo sapiens (Human))
Padlock Therapeutics
US Patent
LigandPNGBDBM501409(US11026937, Compound I-4)
Affinity DataIC50:  1.50E+3nM. Assay description: Assay buffer (as aforementioned): 100 mM Tris-HCl (pH 7.6), 2 mM DTT, 1 mM CaCl2Final concentrations:100 nM hPAD4 enzyme50 μM (8-fold sub-Km) su...
Ligand InfoPC cidPC sid
In DepthDetails US Patent