BDBM50142270 CHEMBL3758441
SMILES Cc1cc(cc(n1)C(=O)NCc1ccc(F)c(c1)C(F)(F)F)-c1nnn(C[C@H]2CC[C@H](CO)CC2)n1
InChI Key InChIKey=AAHIWAQFSZSKND-WKILWMFISA-N
Data  1 KI
  Tab Delimited (TSV)   2D SDfile   Computed 3D by Vconf -m prep SDfile
Find this compound or compounds like it in BindingDB:
Activity Spreadsheet -- Enzyme Inhibition Constant Data from BindingDB
Found 1 hit for monomerid = 50142270
TargetCollagenase 3(Homo sapiens (Human))
Pfizer
Curated by ChEMBL
LigandPNGBDBM50142270(CHEMBL3758441)
Affinity DataKi:  6.30nM. Assay description: Inhibition of full length human recombinant MMP13 using MCA-Arg-Pro-Leu-Gly-Leu-Dpa-Ala-Arg-Glu-Arg-NH2 as substrate preincubated for 60 mins followe...
In DepthDetails ArticlePubMed