BDBM50142634 8-[3,3-Dimethyl-4-(4-pyrimidin-2-yl-piperazin-1-yl)-butyl]-8-aza-spiro[4.5]decane-7,9-dione::CHEMBL44992
SMILES CC(C)(CCN1C(=O)CC2(CCCC2)CC1=O)CN1CCN(CC1)c1ncccn1
InChI Key InChIKey=CNIFISUXMKMCGE-UHFFFAOYSA-N
Data  1 IC50
  Tab Delimited (TSV)   2D SDfile   Computed 3D by Vconf -m prep SDfile
Find this compound or compounds like it in BindingDB:
Activity Spreadsheet -- Enzyme Inhibition Constant Data from BindingDB
Found 1 hit for monomerid = 50142634
Target5-hydroxytryptamine receptor 1A(Homo sapiens (Human))
Arqule
Curated by ChEMBL
LigandPNGBDBM50142634(8-[3,3-Dimethyl-4-(4-pyrimidin-2-yl-piperazin-1-yl...)
Affinity DataIC50:  710nM. Assay description: In vitro binding affinity of the compound against 5-hydroxytryptamine 1A receptor using [3H]-8-OH-DPAT in human CYP3A4 assay
In DepthDetails ArticlePubMed