BDBM50142788 CHEMBL3759491
SMILES Oc1cccc(c1)N1CCN(CCCCNC(=O)c2ccc3ccccc3c2)CC1
InChI Key InChIKey=UYSUVIPTEFGQSA-UHFFFAOYSA-N
Data  3 KI
  Tab Delimited (TSV)   2D SDfile   Computed 3D by Vconf -m prep SDfile
Find this compound or compounds like it in BindingDB:
Activity Spreadsheet -- Enzyme Inhibition Constant Data from BindingDB
Found 3 hits for monomerid = 50142788
TargetD(3) dopamine receptor(Homo sapiens (Human))
Bioprojet-Biotech
Curated by ChEMBL
LigandPNGBDBM50142788(CHEMBL3759491)
Affinity DataKi:  0.200nM. Assay description: Displacement of [3H]-spiperone from human dopamine D3 receptor expressed in CHO cell membranes
In DepthDetails ArticlePubMed
TargetD(2) dopamine receptor(Homo sapiens (Human))
Bioprojet-Biotech
Curated by ChEMBL
LigandPNGBDBM50142788(CHEMBL3759491)
Affinity DataKi:  373nM. Assay description: Displacement of [3H]-spiperone from human dopamine D2S receptor expressed in HEK293 cell membranes
In DepthDetails ArticlePubMed
TargetAlpha-1A adrenergic receptor(Homo sapiens (Human))
Bioprojet-Biotech
Curated by ChEMBL
LigandPNGBDBM50142788(CHEMBL3759491)
Affinity DataKi:  1.53E+3nM. Assay description: Displacement of [3H]-prazosin from human ADRA1A receptor
In DepthDetails ArticlePubMed