BDBM50143019 2-(benzyloxy)-3-methoxy-6,8-dioxabicyclo[3.2.1]oct-4-yl sulfate
SMILES COC1C(OCc2ccccc2)C2COC(O2)C1OS([O-])(=O)=O
InChI Key InChIKey=CLHDFXZIPQDKGI-UHFFFAOYSA-M
Data  2 Kd
  Tab Delimited (TSV)   2D SDfile   Computed 3D by Vconf -m prep SDfile
Find this compound or compounds like it in BindingDB:
Activity Spreadsheet -- Enzyme Inhibition Constant Data from BindingDB
Found 2 hits for monomerid = 50143019
TargetFibroblast growth factor 2(Homo sapiens (Human))
Progen Industries
Curated by ChEMBL
LigandPNGBDBM50143019(2-(benzyloxy)-3-methoxy-6,8-dioxabicyclo[3.2.1]oct...)
Affinity DataKd:  8.02E+6nM. Assay description: Dissociation constant for Fibroblast growth factor 2
In DepthDetails ArticlePubMed
TargetFibroblast growth factor 1(Homo sapiens (Human))
Progen Industries
Curated by ChEMBL
LigandPNGBDBM50143019(2-(benzyloxy)-3-methoxy-6,8-dioxabicyclo[3.2.1]oct...)
Affinity DataKd:  3.07E+5nM. Assay description: Dissociation constant for Fibroblast growth factor 1
In DepthDetails ArticlePubMed