BDBM50143189 CHEMBL3759276
SMILES CCCC(=O)Nc1sccc1C(N)=O
InChI Key InChIKey=QFUOJZBSCYPNSJ-UHFFFAOYSA-N
Data  1 IC50
PDB links: 1 PDB ID matches this monomer.
  Tab Delimited (TSV)   2D SDfile   Computed 3D by Vconf -m prep SDfile
Find this compound or compounds like it in BindingDB:
Activity Spreadsheet -- Enzyme Inhibition Constant Data from BindingDB
Found 1 hit for monomerid = 50143189
TargetDNA gyrase subunit B(Staphylococcus aureus)
Cubist Pharmaceuticals
Curated by ChEMBL
LigandPNGBDBM50143189(CHEMBL3759276)
Affinity DataIC50:  5.00E+4nM. Assay description: Binding affinity to full length Staphylococcus aureus GyrB by STD-NMR spectroscopic analysis