BDBM50143279 (S)-2-(6-Chloro-pyridin-3-yl)-7-aza-bicyclo[2.2.1]heptane::CHEMBL54902
SMILES Clc1ccc(cn1)C1C[C@@H]2CCC1N2
InChI Key InChIKey=NLPRAJRHRHZCQQ-IDKOKCKLSA-N
Data  1 KI
  Tab Delimited (TSV)   2D SDfile   Computed 3D by Vconf -m prep SDfile
Find this compound or compounds like it in BindingDB:
Activity Spreadsheet -- Enzyme Inhibition Constant Data from BindingDB
Found 1 hit for monomerid = 50143279
TargetNeuronal acetylcholine receptor subunit alpha-4/beta-2(Homo sapiens (Human))
Virginia Commonwealth University
Curated by ChEMBL
LigandPNGBDBM50143279((S)-2-(6-Chloro-pyridin-3-yl)-7-aza-bicyclo[2.2.1]...)
Affinity DataKi:  0.0500nM. Assay description: Binding affinity towards nicotinic acetylcholine receptor alpha4-beta2
In DepthDetails ArticlePubMed