BDBM50143419 CHEMBL175336::Sodium; 3,4-dihydroxy-9,10-dioxo-9,10-dihydro-anthracene-2-sulfonate
SMILES Oc1c(O)c2C(=O)c3ccccc3C(=O)c2cc1S([O-])(=O)=O
InChI Key InChIKey=JKYKXTRKURYNGW-UHFFFAOYSA-M
Data  4 IC50
  Tab Delimited (TSV)   2D SDfile   Computed 3D by Vconf -m prep SDfile
Find this compound or compounds like it in BindingDB:
Activity Spreadsheet -- Enzyme Inhibition Constant Data from BindingDB
Found 4 hits for monomerid = 50143419
TargetTyrosine-protein phosphatase non-receptor type 1(Homo sapiens (Human))
Inha University
Curated by ChEMBL
LigandPNGBDBM50143419(CHEMBL175336 | Sodium; 3,4-dihydroxy-9,10-dioxo-9,...)
Affinity DataIC50:  4.00E+4nM. Assay description: Inhibition of human PTPase 1B
In DepthDetails ArticlePubMed
TargetPyruvate kinase PKLR(Homo sapiens (Human))
University Of Gothenburg
Curated by ChEMBL
LigandPNGBDBM50143419(CHEMBL175336 | Sodium; 3,4-dihydroxy-9,10-dioxo-9,...)
Affinity DataIC50:  200nM. Assay description: Inhibition of PKL (unknown origin) for 30 mins by Kinase-Glo Max reagent based luminescence assay
In DepthDetails PubMed
TargetPhosphoglycerate mutase 1(Homo sapiens (Human))
China Pharmaceutical University
Curated by ChEMBL
LigandPNGBDBM50143419(CHEMBL175336 | Sodium; 3,4-dihydroxy-9,10-dioxo-9,...)
Affinity DataIC50:  2.30E+3nM. Assay description: Inhibition of PGAM1 (unknown origin)
In DepthDetails ArticlePubMed
TargetTyrosine-protein phosphatase 1(Saccharomyces cerevisiae)
Inha University
Curated by ChEMBL
LigandPNGBDBM50143419(CHEMBL175336 | Sodium; 3,4-dihydroxy-9,10-dioxo-9,...)
Affinity DataIC50:  4.80E+4nM. Assay description: Inhibitory activity against Saccharomyces cerevisiae Tyrosine phosphatase 1
In DepthDetails ArticlePubMed