BDBM50143643 CHEMBL56642::N-{5-[2-(4-Chloro-quinolin-2-yl)-vinyl]-naphthalen-2-yl}-C,C,C-trifluoro-methanesulfonamide
SMILES FC(F)(F)S(=O)(=O)Nc1ccc2c(\C=C\c3cc(Cl)c4ccccc4n3)cccc2c1
InChI Key InChIKey=KFXPPIODFLJZJG-CMDGGOBGSA-N
Data  1 IC50
  Tab Delimited (TSV)   2D SDfile   Computed 3D by Vconf -m prep SDfile
Find this compound or compounds like it in BindingDB:
Activity Spreadsheet -- Enzyme Inhibition Constant Data from BindingDB
Found 1 hit for monomerid = 50143643
TargetCapsid scaffolding protein(Human cytomegalovirus (strain AD169) (HHV-5) (Huma...)
Wyeth Research
Curated by ChEMBL
LigandPNGBDBM50143643(CHEMBL56642 | N-{5-[2-(4-Chloro-quinolin-2-yl)-vin...)
Affinity DataIC50:  10.5nM. Assay description: Inhibitory concentration against HCMV protease.
In DepthDetails ArticlePubMed