BDBM50143955 2-{4-[2-Hydroxy-3-(4-methoxy-phenoxy)-propyl]-piperazin-1-yl}-N-(4-methoxy-benzyl)-2-(4-trifluoromethyl-phenyl)-acetamide::CHEMBL60622
SMILES COc1ccc(CNC(=O)C(N2CCN(CC(O)COc3ccc(OC)cc3)CC2)c2ccc(cc2)C(F)(F)F)cc1
InChI Key InChIKey=DZUGSBICBIZJLT-UHFFFAOYSA-N
Data  1 KI  1 IC50
  Tab Delimited (TSV)   2D SDfile   Computed 3D by Vconf -m prep SDfile
Find this compound or compounds like it in BindingDB:
Activity Spreadsheet -- Enzyme Inhibition Constant Data from BindingDB
Found 2 hits for monomerid = 50143955
TargetCytochrome P450 2D6(Homo sapiens (Human))
Arqule
Curated by ChEMBL
LigandPNGBDBM50143955(2-{4-[2-Hydroxy-3-(4-methoxy-phenoxy)-propyl]-pipe...)
Affinity DataKi:  4.00E+3nM. Assay description: Predictive competitive inhibition of cytochrome P450 2D6 was determined in silico
In DepthDetails ArticlePubMed
TargetSodium channel protein type 1/2/3 subunit alpha(Rattus norvegicus)
Arqule
Curated by ChEMBL
LigandPNGBDBM50143955(2-{4-[2-Hydroxy-3-(4-methoxy-phenoxy)-propyl]-pipe...)
Affinity DataIC50:  359nM. Assay description: In vitro inhibition of [3H]-batrachotoxin binding to neurotoxin site 2 of sodium (Na+) channel in rat cerebral cortex membrane
In DepthDetails ArticlePubMed