BDBM50144435 1-methyl-5-[2'-oxospiro[cyclohexane-1,3'-(2',3'-dihydro-1'H-indole)]-5-yl]-1H-2-pyrrolecarbonitrile::5-(spiro[cyclohexane-1,3'-[3H]indole]-2'-oxo-5'-yl)-1H-pyrrole-1-methyl-2-carbonitrile::CHEMBL305298
SMILES Cn1c(ccc1-c1ccc2NC(=O)C3(CCCCC3)c2c1)C#N
InChI Key InChIKey=WMIPEGGWIZEEMY-UHFFFAOYSA-N
Data  2 IC50  2 EC50
  Tab Delimited (TSV)   2D SDfile   Computed 3D by Vconf -m prep SDfile
Find this compound or compounds like it in BindingDB:
Activity Spreadsheet -- Enzyme Inhibition Constant Data from BindingDB
Found 4 hits for monomerid = 50144435
TargetProgesterone receptor(Homo sapiens (Human))
Wyeth Research
Curated by ChEMBL
LigandPNGBDBM50144435(1-methyl-5-[2'-oxospiro[cyclohexane-1,3'-(2',3'-di...)
Affinity DataIC50: >3.00E+3nM. Assay description: Ability to block progesterone induced alkaline phosphatase activity in T47D human breast cancer cell line
In DepthDetails ArticlePubMed
TargetProgesterone receptor(Homo sapiens (Human))
Wyeth Research
Curated by ChEMBL
LigandPNGBDBM50144435(1-methyl-5-[2'-oxospiro[cyclohexane-1,3'-(2',3'-di...)
Affinity DataEC50:  2.30nM. Assay description: Agonist activity at human PR expressed in human T47D cells assessed as stimulation of alkaline phosphatase
In DepthDetails ArticlePubMed
TargetProgesterone receptor(Homo sapiens (Human))
Wyeth Research
Curated by ChEMBL
LigandPNGBDBM50144435(1-methyl-5-[2'-oxospiro[cyclohexane-1,3'-(2',3'-di...)
Affinity DataIC50:  3.30nM. Assay description: Displacement of [3H]R5020 from human PR in human T47D cells by whole cell assay
In DepthDetails ArticlePubMed
TargetProgesterone receptor(Homo sapiens (Human))
Wyeth Research
Curated by ChEMBL
LigandPNGBDBM50144435(1-methyl-5-[2'-oxospiro[cyclohexane-1,3'-(2',3'-di...)
Affinity DataEC50:  2.80nM. Assay description: Agonistic activity measures the ability to induce alkaline phosphatase in T47D human breast cancer cell line
In DepthDetails ArticlePubMed