BDBM50145344 1-{2-[4-(6-Fluoro-1-methyl-1H-indol-3-yl)-3,6-dihydro-2H-pyridin-1-yl]-ethyl}-isochroman-6-carboxylic acid amide::CHEMBL311323
SMILES Cn1cc(C2=CCN(CCC3OCCc4cc(ccc34)C(N)=O)CC2)c2ccc(F)cc12
InChI Key InChIKey=HMBHJNCGAIXIKJ-UHFFFAOYSA-N
Data  5 KI
  Tab Delimited (TSV)   2D SDfile   Computed 3D by Vconf -m prep SDfile
Find this compound or compounds like it in BindingDB:
Activity Spreadsheet -- Enzyme Inhibition Constant Data from BindingDB
Found 5 hits for monomerid = 50145344
TargetSodium-dependent serotonin transporter(Rattus norvegicus (rat))
Eli Lilly
Curated by ChEMBL
LigandPNGBDBM50145344(1-{2-[4-(6-Fluoro-1-methyl-1H-indol-3-yl)-3,6-dihy...)
Affinity DataKi:  0.980nM. Assay description: In vitro binding affinity towards serotonin transporter using [3H]citalopram as radioligand in rat cerebral cortex membranes
In DepthDetails ArticlePubMed
TargetAlpha-1A/Alpha-1B/Alpha-1D adrenergic receptor(Rattus norvegicus (rat))
Eli Lilly
Curated by ChEMBL
LigandPNGBDBM50145344(1-{2-[4-(6-Fluoro-1-methyl-1H-indol-3-yl)-3,6-dihy...)
Affinity DataKi:  17nM. Assay description: Binding affinity determined against alpha-1 adrenergic receptor in rat cortex membranes using [3H]prazosin as radioligand
In DepthDetails ArticlePubMed
Target5-hydroxytryptamine receptor 1D(Homo sapiens (Human))
Eli Lilly
Curated by ChEMBL
LigandPNGBDBM50145344(1-{2-[4-(6-Fluoro-1-methyl-1H-indol-3-yl)-3,6-dihy...)
Affinity DataKi:  65nM. Assay description: Binding affinity towards human 5-hydroxytryptamine 1D receptor in L-M(tk-) cells using [3H]GR-125743 as radioligand
In DepthDetails ArticlePubMed
TargetD(2) dopamine receptor(Rattus norvegicus (rat))
Eli Lilly
Curated by ChEMBL
LigandPNGBDBM50145344(1-{2-[4-(6-Fluoro-1-methyl-1H-indol-3-yl)-3,6-dihy...)
Affinity DataKi:  73nM. Assay description: Binding affinity determined against dopamine receptor D2 in rat caudate membranes using [3H]- raclopride as radioligand
In DepthDetails ArticlePubMed
Target5-hydroxytryptamine receptor 1B(Homo sapiens (Human))
Eli Lilly
Curated by ChEMBL
LigandPNGBDBM50145344(1-{2-[4-(6-Fluoro-1-methyl-1H-indol-3-yl)-3,6-dihy...)
Affinity DataKi: >1.00E+3nM. Assay description: Binding affinity towards human 5-hydroxytryptamine 1B receptor in L-M(tk-) cells using [3H]GR-125743 as radioligand
In DepthDetails ArticlePubMed