BDBM501454 US11026937, Compound I-49
SMILES Fc1ccc2c(-c3ccccc3)c(C(=O)\C=C\c3cccnc3)c(=O)[nH]c2c1
InChI Key InChIKey=BCBXTIMNEQSJON-DHZHZOJOSA-N
Data  1 IC50
  Tab Delimited (TSV)   2D SDfile   Computed 3D by Vconf -m prep SDfile
Find this compound or compounds like it in BindingDB:
Activity Spreadsheet -- Enzyme Inhibition Constant Data from BindingDB
Found 1 hit for monomerid = 501454
TargetProtein-arginine deiminase type-4(Homo sapiens (Human))
Padlock Therapeutics
US Patent
LigandPNGBDBM501454(US11026937, Compound I-49)
Affinity DataIC50:  1.50E+3nM. Assay description: Assay buffer (as aforementioned): 100 mM Tris-HCl (pH 7.6), 2 mM DTT, 1 mM CaCl2Final concentrations:100 nM hPAD4 enzyme50 μM (8-fold sub-Km) su...
Ligand InfoPC cidPC sid
In DepthDetails US Patent