BDBM50145596 CHEMBL3764009
SMILES COc1ccc(cc1)N1CCN(CCCNC(=O)c2ccncc2)CC1
InChI Key InChIKey=OWANOSLLDQVMDE-UHFFFAOYSA-N
Data  3 KI
  Tab Delimited (TSV)   2D SDfile   Computed 3D by Vconf -m prep SDfile
Find this compound or compounds like it in BindingDB:
Activity Spreadsheet -- Enzyme Inhibition Constant Data from BindingDB
Found 3 hits for monomerid = 50145596
Target5-hydroxytryptamine receptor 1A(Rattus norvegicus (rat))
Dipartimento Di Farmacia Universit£
Curated by ChEMBL
LigandPNGBDBM50145596(CHEMBL3764009)
Affinity DataKi:  25nM. Assay description: Displacement of [3H]8-OH-DPAT from 5HT1A receptor in Sprague-Dawley rat brain cortex incubated for 30 mins by liquid scintillation counting analysis
In DepthDetails ArticlePubMed
Target5-hydroxytryptamine receptor 2A(Rattus norvegicus (rat))
Dipartimento Di Farmacia Universit£
Curated by ChEMBL
LigandPNGBDBM50145596(CHEMBL3764009)
Affinity DataKi:  1.26E+3nM. Assay description: Displacement of [3H]ketanserin from 5HT2A receptor in Sprague-Dawley rat brain cortex incubated for 15 mins by liquid scintillation counting analysis
In DepthDetails ArticlePubMed
Target5-hydroxytryptamine receptor 2C(Rattus norvegicus (Rat))
Dipartimento Di Farmacia Universit£
Curated by ChEMBL
LigandPNGBDBM50145596(CHEMBL3764009)
Affinity DataKi: >1.00E+4nM. Assay description: Displacement of [3H]mesulergine from 5HT2C receptor in Sprague-Dawley rat brain cortex incubated for 15 mins by liquid scintillation counting analysi...
In DepthDetails ArticlePubMed