BDBM50145658 CHEMBL3764570
SMILES Cc1ccn(n1)-c1cc(Cl)ccc1[C@@H](Oc1cc(nc(N)n1)N1CCC(CC1)NCC(O)=O)C(F)(F)F
InChI Key InChIKey=MZCRPJLEEYOCTN-OAQYLSRUSA-N
Data  1 IC50
  Tab Delimited (TSV)   2D SDfile   Computed 3D by Vconf -m prep SDfile
Find this compound or compounds like it in BindingDB:
Activity Spreadsheet -- Enzyme Inhibition Constant Data from BindingDB
Found 1 hit for monomerid = 50145658
TargetTryptophan 5-hydroxylase 1(Homo sapiens (Human))
Karos Pharmaceuticals
Curated by ChEMBL
LigandPNGBDBM50145658(CHEMBL3764570)
Affinity DataIC50:  1.51E+3nM. Assay description: Inhibition of TPH1 (unknown origin)
In DepthDetails ArticlePubMed