BDBM50145674 CHEMBL2436531
SMILES CCOC(=O)c1sc(N\N=C\c2ccc(O)c(OC)c2)nc1C
InChI Key InChIKey=VZZHFEFHMHCYCG-LZYBPNLTSA-N
Data  1 IC50
  Tab Delimited (TSV)   2D SDfile   Computed 3D by Vconf -m prep SDfile
Find this compound or compounds like it in BindingDB:
Activity Spreadsheet -- Enzyme Inhibition Constant Data from BindingDB
Found 1 hit for monomerid = 50145674
TargetLeucine--tRNA ligase, cytoplasmic(Homo sapiens (Human))
Nas Of Ukraine
Curated by ChEMBL
LigandPNGBDBM50145674(CHEMBL2436531)
Affinity DataIC50:  1.16E+5nM. Assay description: Inhibition of human leucyl-tRNA synthetase assessed as reduction of [14C]-L-leucine ligation to tRNA incubated for 5 mins by scintillation counting m...
In DepthDetails ArticlePubMed