BDBM501462 US11026937, Compound I-56
SMILES O=C(\C=C\c1ccc(OCCC2CCOCC2)nc1)c1c(-c2ccccc2)c2ccncc2[nH]c1=O
InChI Key InChIKey=AMNQBYGNUCOYKU-SOFGYWHQSA-N
Data  1 IC50
  Tab Delimited (TSV)   2D SDfile   Computed 3D by Vconf -m prep SDfile
Find this compound or compounds like it in BindingDB:
Activity Spreadsheet -- Enzyme Inhibition Constant Data from BindingDB
Found 1 hit for monomerid = 501462
TargetProtein-arginine deiminase type-4(Homo sapiens (Human))
Padlock Therapeutics
US Patent
LigandPNGBDBM501462(US11026937, Compound I-56)
Affinity DataIC50:  1.15E+4nM. Assay description: Assay buffer (as aforementioned): 100 mM Tris-HCl (pH 7.6), 2 mM DTT, 1 mM CaCl2Final concentrations:100 nM hPAD4 enzyme50 μM (8-fold sub-Km) su...
Ligand InfoPC cidPC sid
In DepthDetails US Patent