BDBM50146427 (S)-1-((1S,5R)-5-Benzoylamino-2-methyl-4-oxo-6-phenyl-hexanoyl)-pyrrolidine-2-carboxylic acid::CHEMBL328537
SMILES C[C@@H](CC(=O)[C@@H](Cc1ccccc1)NC(=O)c1ccccc1)C(=O)N1CCC[C@H]1C(O)=O
InChI Key InChIKey=YIMJMPFFIWOIDL-WMQCIHAUSA-N
Data  2 IC50
  Tab Delimited (TSV)   2D SDfile   Computed 3D by Vconf -m prep SDfile
Find this compound or compounds like it in BindingDB:
Activity Spreadsheet -- Enzyme Inhibition Constant Data from BindingDB
Found 2 hits for monomerid = 50146427
TargetAngiotensin-converting enzyme(Homo sapiens (Human))
Bristol-Myers Squibb Pharmaceutical Research And Development
Curated by ChEMBL
LigandPNGBDBM50146427((S)-1-((1S,5R)-5-Benzoylamino-2-methyl-4-oxo-6-phe...)
Affinity DataIC50:  3.20E+3nM. Assay description: Inhibition of ACE
In DepthDetails ArticlePubMed
TargetAngiotensin-converting enzyme(Oryctolagus cuniculus)
State University Of New York
Curated by ChEMBL
LigandPNGBDBM50146427((S)-1-((1S,5R)-5-Benzoylamino-2-methyl-4-oxo-6-phe...)
Affinity DataIC50:  3.20E+3nM. Assay description: Inhibitory activity of compound against angiotensin I converting enzyme was determined
In DepthDetails ArticlePubMed