BDBM50146749 2,3,5,6-Tetrafluoro-N-[3-methyl-5-sulfamoyl-3H-[1,3,4]thiadiazol-(2E)-ylidene]-benzamide::CHEMBL94341
SMILES Cn1nc(s\c1=N\C(=O)c1c(F)c(F)cc(F)c1F)S(N)(=O)=O
InChI Key InChIKey=QGSOGWMSZGIIKI-CXUHLZMHSA-N
Data  3 KI
  Tab Delimited (TSV)   2D SDfile   Computed 3D by Vconf -m prep SDfile
Find this compound or compounds like it in BindingDB:
Activity Spreadsheet -- Enzyme Inhibition Constant Data from BindingDB
Found 3 hits for monomerid = 50146749
TargetCarbonic anhydrase 2(Homo sapiens (Human))
Universit£
Curated by ChEMBL
LigandPNGBDBM50146749(2,3,5,6-Tetrafluoro-N-[3-methyl-5-sulfamoyl-3H-[1,...)
Affinity DataKi:  1.40nM. Assay description: In vitro inhibitory activity against human carbonic anhydrase II (hCAII)
In DepthDetails ArticlePubMed
TargetCarbonic anhydrase 4(Bos taurus (bovine))
Universit£
Curated by ChEMBL
LigandPNGBDBM50146749(2,3,5,6-Tetrafluoro-N-[3-methyl-5-sulfamoyl-3H-[1,...)
Affinity DataKi:  28nM. Assay description: In vitro inhibitory activity against bovine carbonic anhydrase IV (CAIV)
In DepthDetails ArticlePubMed
TargetCarbonic anhydrase 1(Homo sapiens (Human))
Universit£
Curated by ChEMBL
LigandPNGBDBM50146749(2,3,5,6-Tetrafluoro-N-[3-methyl-5-sulfamoyl-3H-[1,...)
Affinity DataKi:  270nM. Assay description: In vitro inhibitory activity against human carbonic anhydrase I (hCAI)
In DepthDetails ArticlePubMed