BDBM50146834 CHEMBL3764802
SMILES C(Cc1c[nH]c2ncccc12)Cn1nncc1-c1c[nH]c2ncccc12
InChI Key InChIKey=WBEVWUSUHHBDCE-UHFFFAOYSA-N
Data  2 IC50
  Tab Delimited (TSV)   2D SDfile   Computed 3D by Vconf -m prep SDfile
Find this compound or compounds like it in BindingDB:
Activity Spreadsheet -- Enzyme Inhibition Constant Data from BindingDB
Found 2 hits for monomerid = 50146834
TargetCyclin-dependent kinase 2/G1/S-specific cyclin-E1(Homo sapiens (Human))
University Of Tours
Curated by ChEMBL
LigandPNGBDBM50146834(CHEMBL3764802)
Affinity DataIC50:  2.70E+3nM. Assay description: Inhibition of CDK2/Cyclin E (unknown origin) expressed in baculoviral infected insect Sf9 cells using histone H1 as substrate in presence of [gamma-3...
In DepthDetails ArticlePubMed
TargetCyclin-dependent kinase 2/G1/S-specific cyclin-E1(Homo sapiens (Human))
University Of Tours
Curated by ChEMBL
LigandPNGBDBM50146834(CHEMBL3764802)
Affinity DataIC50:  2.51E+3nM. Assay description: Inhibition of CDK2/Cyclin E (unknown origin) expressed in baculoviral infected insect Sf9 cells using histone H1 as substrate in presence of [gamma-3...
In DepthDetails ArticlePubMed