BDBM50146925 CHEMBL3765564
SMILES NC(=O)C(=O)NNC(=O)Nc1cccc2-c3n[nH]c(c3C(=O)c12)-c1ccc(O)cc1
InChI Key InChIKey=MEMAKQQENDHEAV-UHFFFAOYSA-N
Data  1 IC50
  Tab Delimited (TSV)   2D SDfile   Computed 3D by Vconf -m prep SDfile
Find this compound or compounds like it in BindingDB:
Activity Spreadsheet -- Enzyme Inhibition Constant Data from BindingDB
Found 1 hit for monomerid = 50146925
TargetCyclin-dependent kinase 2/G1/S-specific cyclin-E1(Homo sapiens (Human))
University Of Tours
Curated by ChEMBL
LigandPNGBDBM50146925(CHEMBL3765564)
Affinity DataIC50:  19nM. Assay description: Inhibition of CDK2/Cyclin E (unknown origin)
In DepthDetails ArticlePubMed