BDBM50148522 (S)-2-[2-Hydroxy-2-((R)-4-hydroxy-3-methanesulfonylamino-phenyl)-ethylamino]-2-(4-methoxy-phenyl)-N-(3-phenoxy-phenyl)-propionamide::CHEMBL117596
SMILES COc1ccc(cc1)[C@](C)(NC[C@H](O)c1ccc(O)c(NS(C)(=O)=O)c1)C(=O)Nc1cccc(Oc2ccccc2)c1
InChI Key InChIKey=GCSXRBNJMWEMSV-SMCANUKXSA-N
Data  1 KI
  Tab Delimited (TSV)   2D SDfile   Computed 3D by Vconf -m prep SDfile
Find this compound or compounds like it in BindingDB:
Activity Spreadsheet -- Enzyme Inhibition Constant Data from BindingDB
Found 1 hit for monomerid = 50148522
TargetBeta-3 adrenergic receptor(Homo sapiens (Human))
Bristol-Myers Squibb Pharmaceutical Research Institute
Curated by ChEMBL
LigandPNGBDBM50148522((S)-2-[2-Hydroxy-2-((R)-4-hydroxy-3-methanesulfony...)
Affinity DataKi:  490nM. Assay description: Binding affinity towards human beta-3 adrenergic receptor expressed in CHO cells
In DepthDetails ArticlePubMed