BDBM50148588 CHEMBL325304::Heptyl-phosphonic acid monoethyl ester::ethyl hydrogen heptylphosphonate
SMILES CCCCCCCP(O)(=O)OCC
InChI Key InChIKey=HCDLTAHUJKIXJE-UHFFFAOYSA-N
Data  2 IC50
  Tab Delimited (TSV)   2D SDfile   Computed 3D by Vconf -m prep SDfile
Find this compound or compounds like it in BindingDB:
Activity Spreadsheet -- Enzyme Inhibition Constant Data from BindingDB
Found 2 hits for monomerid = 50148588
TargetDiacylglycerol acyltransferase/mycolyltransferase Ag85C(Mycobacterium tuberculosis)
University Of Ljubljana
Curated by ChEMBL
LigandPNGBDBM50148588(CHEMBL325304 | Heptyl-phosphonic acid monoethyl es...)
Affinity DataIC50:  1.10E+3nM. Assay description: Inhibition of Mycobacterium tuberculosis recombinant antigen 85C mycolyltransferase
In DepthDetails ArticlePubMed
TargetDiacylglycerol acyltransferase/mycolyltransferase Ag85C(Mycobacterium tuberculosis)
University Of Ljubljana
Curated by ChEMBL
LigandPNGBDBM50148588(CHEMBL325304 | Heptyl-phosphonic acid monoethyl es...)
Affinity DataIC50:  1.06E+3nM. Assay description: In vitro concentration required to inhibit antigen 85C mycolyltransferase activity in Mycobaterium tuberculosis
In DepthDetails ArticlePubMed