BDBM50148893 CHEMBL332101::Cyclopropylmethyl-[3-(4-methoxy-phenyl)-2,5-dimethyl-3H-pyrazolo[1,5-a]pyrimidin-7-yl]-propyl-amine
SMILES CCCN(CC1CC1)c1cc(C)nc2c(c(C)nn12)-c1ccc(OC)cc1
InChI Key InChIKey=WMMCIPACDGGJDL-UHFFFAOYSA-N
Data  1 KI
  Tab Delimited (TSV)   2D SDfile   Computed 3D by Vconf -m prep SDfile
Find this compound or compounds like it in BindingDB:
Activity Spreadsheet -- Enzyme Inhibition Constant Data from BindingDB
Found 1 hit for monomerid = 50148893
TargetCorticotropin-releasing factor receptor 1(Homo sapiens (Human))
Neurocrine Biosciences
Curated by ChEMBL
LigandPNGBDBM50148893(CHEMBL332101 | Cyclopropylmethyl-[3-(4-methoxy-phe...)
Affinity DataKi:  2.40nM. Assay description: Binding affinity to the cloned human corticotropin releasing factor receptor 1
In DepthDetails ArticlePubMed