BDBM50149202 4-[[GLUTAMIC ACID]-CARBONYL]-BENZENE-SULFONYL-D-PROLINE::CHEMBL325414::N-[4-(D-prolinosulfonyl)benzoyl]-L-glutamic acid
SMILES OC(=O)CC[C@H](NC(=O)c1ccc(cc1)S(=O)(=O)N1CCC[C@@H]1C(O)=O)C(O)=O
InChI Key InChIKey=NDDOUBGQRWFVQM-QWHCGFSZSA-N
Data  1 KI
PDB links: 1 PDB ID matches this monomer.
  Tab Delimited (TSV)   2D SDfile   Computed 3D by Vconf -m prep SDfile
Find this compound or compounds like it in BindingDB:
Activity Spreadsheet -- Enzyme Inhibition Constant Data from BindingDB
Found 1 hit for monomerid = 50149202
TargetThymidylate synthase(Lactobacillus casei)
Sunesis Pharmaceuticals
Curated by ChEMBL
LigandPNGBDBM50149202(4-[[GLUTAMIC ACID]-CARBONYL]-BENZENE-SULFONYL-D-PR...)
Affinity DataKi:  2.40E+4nM. Assay description: Tested for binding affinity towards thymidylate synthase
In DepthDetails ArticlePubMed