BDBM50149217 5-{[5-((R)-1-Carboxy-2-oxo-ethylcarbamoyl)-pyrimidin-2-ylmethyl]-sulfamoyl}-2-hydroxy-benzoic acid::CHEMBL117075
SMILES OC(=O)[C@H](NC(=O)c1cnc(CNS(=O)(=O)c2ccc(O)c(c2)C(O)=O)nc1)C=O
InChI Key InChIKey=SUKMDWJCBDXPIA-LLVKDONJSA-N
Data  1 KI
  Tab Delimited (TSV)   2D SDfile   Computed 3D by Vconf -m prep SDfile
Find this compound or compounds like it in BindingDB:
Activity Spreadsheet -- Enzyme Inhibition Constant Data from BindingDB
Found 1 hit for monomerid = 50149217
TargetCaspase-3(Homo sapiens (Human))
Sunesis Pharmaceuticals
Curated by ChEMBL
LigandPNGBDBM50149217(5-{[5-((R)-1-Carboxy-2-oxo-ethylcarbamoyl)-pyrimid...)
Affinity DataKi:  20nM. Assay description: Binding affinity against Caspase-3
In DepthDetails ArticlePubMed