BDBM50149348 1-(2-Ethyl-butyl)-1H-imidazole::CHEMBL330775
SMILES CCC(CC)Cn1ccnc1
InChI Key InChIKey=YTDSNGSFMKIWFP-UHFFFAOYSA-N
Data  1 IC50
  Tab Delimited (TSV)   2D SDfile   Computed 3D by Vconf -m prep SDfile
Find this compound or compounds like it in BindingDB:
Activity Spreadsheet -- Enzyme Inhibition Constant Data from BindingDB
Found 1 hit for monomerid = 50149348
TargetCamphor 5-monooxygenase(Pseudomonas putida)
University Of California
Curated by ChEMBL
LigandPNGBDBM50149348(1-(2-Ethyl-butyl)-1H-imidazole | CHEMBL330775)
Affinity DataIC50:  800nM. Assay description: Inhibition of wild type cytochrome P450cam expressed in Escherichia coli
In DepthDetails ArticlePubMed