BDBM50149482 CHEMBL3770709
SMILES CC(C)n1ncnc1-c1cn2CCOc3cc(ncc3-c2n1)N1CCC[C@H]1C(N)=O
InChI Key InChIKey=YCKCPIYKXUJHQQ-HNNXBMFYSA-N
Data  1 KI
  Tab Delimited (TSV)   2D SDfile   Computed 3D by Vconf -m prep SDfile
Find this compound or compounds like it in BindingDB:
Activity Spreadsheet -- Enzyme Inhibition Constant Data from BindingDB
Found 1 hit for monomerid = 50149482
LigandPNGBDBM50149482(CHEMBL3770709)
Affinity DataKi:  0.100nM. Assay description: Inhibition of recombinant PI3K alpha (unknown origin) using PIP2 as substrate by fluorescence polarization assay
In DepthDetails ArticlePubMed