BDBM50149670 CHEMBL361782::[3-(3-Chloro-5-trifluoromethyl-pyridin-2-yl)-2,5-dimethyl-pyrazolo[1,5-a]pyrimidin-7-yl]-cyclopropylmethyl-propyl-amine
SMILES CCCN(CC1CC1)c1cc(C)nc2c(c(C)nn12)-c1ncc(cc1Cl)C(F)(F)F
InChI Key InChIKey=UKJSUDFXDGICHW-UHFFFAOYSA-N
Data  1 KI
  Tab Delimited (TSV)   2D SDfile   Computed 3D by Vconf -m prep SDfile
Find this compound or compounds like it in BindingDB:
Activity Spreadsheet -- Enzyme Inhibition Constant Data from BindingDB
Found 1 hit for monomerid = 50149670
TargetCorticotropin-releasing factor receptor 1(Homo sapiens (Human))
Neurocrine Biosciences
Curated by ChEMBL
LigandPNGBDBM50149670(CHEMBL361782 | [3-(3-Chloro-5-trifluoromethyl-pyri...)
Affinity DataKi:  0.800nM. Assay description: Binding affinity for recombinant human CRF1 receptor
In DepthDetails ArticlePubMed