BDBM50149873 CHEMBL182162::{(2R,5S)-4-[2-(4-Methoxy-phenylsulfanyl)-phenyl]-2,5-dimethyl-piperazin-1-yl}-acetic acid
SMILES COc1ccc(Sc2ccccc2N2C[C@@H](C)N(CC(O)=O)C[C@@H]2C)cc1
InChI Key InChIKey=BDOUEVZZKRWFQZ-CVEARBPZSA-N
Data  1 IC50
  Tab Delimited (TSV)   2D SDfile   Computed 3D by Vconf -m prep SDfile
Find this compound or compounds like it in BindingDB:
Activity Spreadsheet -- Enzyme Inhibition Constant Data from BindingDB
Found 1 hit for monomerid = 50149873
TargetSodium- and chloride-dependent glycine transporter 1(Homo sapiens (Human))
H. Lundbeck
Curated by ChEMBL
LigandPNGBDBM50149873(CHEMBL182162 | {(2R,5S)-4-[2-(4-Methoxy-phenylsulf...)
Affinity DataIC50:  160nM. Assay description: Inhibition of uptake of [3H]-glycine into cells transfected with human GlyT-1b transporterChecked by Author
In DepthDetails ArticlePubMed