BDBM50150160 CHEMBL338481::Carbamic acid (4E,6Z,10E)-(8S,9S,12S,13R,14S,16R)-13-hydroxy-19-isobutoxycarbonylamino-8,14-dimethoxy-4,10,12,16-tetramethyl-3,20,22-trioxo-2-aza-bicyclo[16.3.1]docosa-1(21),4,6,10,18-pentaen-9-yl ester
SMILES CO[C@H]1CC(C)=Cc2c(O)c(NC(=O)C(C)=CC=C[C@H](OC)[C@@H](OC(N)=O)\C(C)=C\[C@H](C)[C@H]1O)cc(O)c2NC(=O)OCC(C)C
InChI Key InChIKey=UUMIJRLIKACGMR-BJFQRTAQSA-N
Data  4 IC50
  Tab Delimited (TSV)   2D SDfile   Computed 3D by Vconf -m prep SDfile
Find this compound or compounds like it in BindingDB:
Activity Spreadsheet -- Enzyme Inhibition Constant Data from BindingDB
Found 4 hits for monomerid = 50150160
TargetHeat shock protein HSP 90-alpha/90-beta(Homo sapiens (Human))
Conforma Therapeutics
Curated by ChEMBL
LigandPNGBDBM50150160(CHEMBL338481 | Carbamic acid (4E,6Z,10E)-(8S,9S,12...)
Affinity DataIC50:  3nM. Assay description: Concentration of test compound required for inhibition of binding of rHsp90 in MCF-7 cell lysate
In DepthDetails ArticlePubMed
TargetHeat shock protein HSP 90-alpha/90-beta(Homo sapiens (Human))
Conforma Therapeutics
Curated by ChEMBL
LigandPNGBDBM50150160(CHEMBL338481 | Carbamic acid (4E,6Z,10E)-(8S,9S,12...)
Affinity DataIC50:  120nM. Assay description: Inhibition of human epidermal growth factor 2 (Her-2) degredation in MCF-7 cells
In DepthDetails ArticlePubMed
TargetHeat shock protein HSP 90-alpha/90-beta(Homo sapiens (Human))
Conforma Therapeutics
Curated by ChEMBL
LigandPNGBDBM50150160(CHEMBL338481 | Carbamic acid (4E,6Z,10E)-(8S,9S,12...)
Affinity DataIC50:  2.00E+3nM. Assay description: Concentration required to inhibit biotin-GM binding to recombinant heat shock protein 90(rHsp90)
In DepthDetails ArticlePubMed
TargetHeat shock protein HSP 90-alpha/90-beta(Homo sapiens (Human))
Conforma Therapeutics
Curated by ChEMBL
LigandPNGBDBM50150160(CHEMBL338481 | Carbamic acid (4E,6Z,10E)-(8S,9S,12...)
Affinity DataIC50:  4.00E+3nM. Assay description: Concentration required to inhbit Bis-ANS activity by recombinant heat shock protein 90 (rHSP90) conformational assay
In DepthDetails ArticlePubMed