BDBM50150463 CHEMBL3771371
SMILES Cc1cc(C[C@@H](NC(=O)N2CCC(CC2)c2cc3ccccc3cc2C#N)C(=O)N2CCC(CC2)N2CCCCC2)cc2cn[nH]c12
InChI Key InChIKey=SXTOEKCKDHJYEH-PGUFJCEWSA-N
Data  1 IC50
  Tab Delimited (TSV)   2D SDfile   Computed 3D by Vconf -m prep SDfile
Find this compound or compounds like it in BindingDB:
Activity Spreadsheet -- Enzyme Inhibition Constant Data from BindingDB
Found 1 hit for monomerid = 50150463
TargetCalcitonin gene-related peptide 1(Homo sapiens (Human))
Bristol-Myers Squibb Discovery
Curated by ChEMBL
LigandPNGBDBM50150463(CHEMBL3771371)
Affinity DataIC50:  0.110nM. Assay description: Displacement of [125I]CGRP from alpha CGRP in human SK-N-MC cells after 2 hrs by scintillation counter
In DepthDetails ArticlePubMed