BDBM50151 3-Amino-6,7-dimethoxy-thieno[2,3-b]quinoline-2-carboxylic acid (3-cyano-4,5-dimethyl-thiophen-2-yl)-amide::3-amino-N-(3-cyano-4,5-dimethyl-2-thienyl)-6,7-dimethoxy-thieno[2,3-b]quinoline-2-carboxamide::3-amino-N-(3-cyano-4,5-dimethyl-2-thiophenyl)-6,7-dimethoxy-2-thieno[2,3-b]quinolinecarboxamide::3-amino-N-(3-cyano-4,5-dimethylthiophen-2-yl)-6,7-dimethoxythieno[2,3-b]quinoline-2-carboxamide::3-azanyl-N-(3-cyano-4,5-dimethyl-thiophen-2-yl)-6,7-dimethoxy-thieno[2,3-b]quinoline-2-carboxamide::MLS000556630::SMR000173140::cid_3207470
SMILES COc1cc2cc3c(N)c(sc3nc2cc1OC)C(=O)Nc1sc(C)c(C)c1C#N
InChI Key InChIKey=LIFGQVFZCIHISM-UHFFFAOYSA-N
Data  5 IC50
  Tab Delimited (TSV)   2D SDfile   Computed 3D by Vconf -m prep SDfile
Find this compound or compounds like it in BindingDB:
Activity Spreadsheet -- Enzyme Inhibition Constant Data from BindingDB
Found 5 hits for monomerid = 50151
TargetInduced myeloid leukemia cell differentiation protein Mcl-1(Homo sapiens (Human))
Emory University
Curated by PubChem BioAssay
LigandPNGBDBM50151(3-Amino-6,7-dimethoxy-thieno[2,3-b]quinoline-2-car...)
Affinity DataIC50:  1.26E+3nM. Assay description: NIH Molecular Libraries Screening Centers Network [MLSCN] Emory Chemical Biology Discovery Center in MLSCN Assay provider: Nikolovska-Coleska, Univer...
In DepthDetails PCBioAssay
TargetGenome polyprotein(Hepatitis C virus)
The Scripps Research Institute Molecular Screening Center
Curated by PubChem BioAssay
LigandPNGBDBM50151(3-Amino-6,7-dimethoxy-thieno[2,3-b]quinoline-2-car...)
Affinity DataIC50: >3.63E+4nM. Assay description: Source (MLPCN Center Name): The Scripps Research Institute Molecular Screening Center (SRIMSC) Center Affiliation: The Scripps Research Institute (TS...
In DepthDetails PCBioAssay
Target26S proteasome non-ATPase regulatory subunit 14(Homo sapiens (Human))
Burnham Center For Chemical Genomics
Curated by PubChem BioAssay
LigandPNGBDBM50151(3-Amino-6,7-dimethoxy-thieno[2,3-b]quinoline-2-car...)
Affinity DataIC50:  4.83E+4nM. Assay description: Data Source: Sanford-Burnham Center for Chemical Genomics (SBCCG) Source Affiliation: Sanford Burnham Medical Research Institute (SBMRI, La Jolla, CA...
In DepthDetails PCBioAssay
TargetProthrombin(Bos taurus (Bovine))
Burnham Center For Chemical Genomics
Curated by PubChem BioAssay
LigandPNGBDBM50151(3-Amino-6,7-dimethoxy-thieno[2,3-b]quinoline-2-car...)
Affinity DataIC50:  2.58E+4nM. Assay description: Data Source: Sanford-Burnham Center for Chemical Genomics (SBCCG) Source Affiliation: Sanford Burnham Medical Research Institute (SBMRI, La Jolla, CA...
In DepthDetails PCBioAssay
TargetVoltage-dependent N-type calcium channel subunit alpha-1B(Homo sapiens (Human))
Burnham Center For Chemical Genomics
Curated by PubChem BioAssay
LigandPNGBDBM50151(3-Amino-6,7-dimethoxy-thieno[2,3-b]quinoline-2-car...)
Affinity DataIC50:  1.18E+4nM. Assay description: Data Source: Data Source: Sanford-Burnham Center for Chemical Genomics (SBCCG) Source Affiliation: Sanford-Burnham Medical Research Institute Network...
In DepthDetails PCBioAssay